\x93s\x93\xB9\x95{\x8C\xA7,\x8D\x87\x8Cv\x81i\x91\xE0\x81j,\x8Fd\x95\xA1\x82\xF0\x8F\x9C\x82\xAD\x8D\x87\x8Cv\x81i\x91\xE0\x81j,\x8Ew\x8A\xF6\x8Ex\x89\x87\x91\xE0\x81i\x91\xE0\x81j,\x93\x9D\x8D\x87\x8B@\x93\xAE\x95\x94\x91\xE0\x8Ew\x8A\xF6\x91\xE0\x81i\x91\xE0\x81j,\x83G\x83l\x83\x8B\x83M\x81[\x81E\x8EY\x8BƊ\xEE\x94ՍЊQ\x91\xA6\x89\x9E\x95\x94\x91\xE0\x8Ew\x8A\xF6\x91\xE0\x81i\x91\xE0\x81j,\x93s\x93\xB9\x95{\x8C\xA7\x91\xE5\x91\xE0\x8Ew\x8A\xF6\x91\xE0\x81i\x91\xE0\x81j,\x8F\xC1\x89Ώ\xAC\x91\xE0\x81i\x91\xE0\x81j,\x8B~\x8F\x95\x8F\xAC\x91\xE0\x81i\x91\xE0\x81j,\x8B~\x8B}\x8F\xAC\x91\xE0\x81i\x91\xE0\x81j,\x8C\xE3\x95\xFB\x8Ex\x89\x87\x8F\xAC\x91\xE0\x81i\x91\xE0\x81j,\x92ʐM\x8Ex\x89\x87\x8F\xAC\x91\xE0\x81i\x91\xE0\x81j,\x93\xC1\x8E\xEA\x8DЊQ\x8F\xAC\x91\xE0\x93Ō\x80\x95\xA8\x8DЊQ\x81i\x91\xE0\x81j,\x93\xC1\x8E\xEA\x8DЊQ\x8F\xAC\x91\xE0\x91\xE5\x8BK\x96͊댯\x95\xA8\x89΍Ёi\x91\xE0\x81j,\x93\xC1\x8E\xEA\x8DЊQ\x8F\xAC\x91\xE0\x96\xA7\x95\xF3\x8Aԉ΍Ёi\x91\xE0\x81j,\x93\xC1\x8Eꑕ\x94\xF5\x8F\xAC\x91\xE0\x89\x93\x8B\x97\x97\xA3\x91\x97\x90\x85\x81i\x91\xE0\x81j,\x93\xC1\x8Eꑕ\x94\xF5\x8F\xAC\x91\xE0\x93\xF1\x97֎ԁi\x91\xE0\x81j,\x93\xC1\x8Eꑕ\x94\xF5\x8F\xAC\x91\xE0\x90k\x8DБΉ\x9E\x81i\x91\xE0\x81j,\x93\xC1\x8Eꑕ\x94\xF5\x8F\xAC\x91\xE0\x90\x85\x93\xEF\x8B~\x8F\x95\x91\xE0\x81i\x91\xE0\x81j,\x93\xC1\x8Eꑕ\x94\xF5\x8F\xAC\x91\xE0\x82\xBB\x82̑\xBC\x93\xC1\x8E\xEA\x8Eԗ\xBC\x81i\x91\xE0\x81j,\x8Dq\x8B󏬑\xE0\x81i\x91\xE0\x81j,\x90\x85\x8F㏬\x91\xE0\x81i\x91\xE0\x81j
\x96k\x8AC\x93\xB9,292,280,2,1,,6,111,23,74,38,1,10,6,1,2,,1,4,9,3,
\x90X,105,103,,1,,3,39,6,23,18,,1,9,,,,1,1,2,1,
\x8A\xE2\x8E\xE8,90,87,,1,,3,35,6,21,17,1,2,,,,,,1,2,1,
\x8B{\x8F\xE9,122,119,3,1,,3,45,9,20,21,1,3,3,1,2,,1,1,5,3,
\x8FH\x93c,83,81,,1,,3,34,7,18,11,,1,5,,,,,,2,1,
\x8ER\x8C`,63,62,,1,,2,24,6,15,11,,1,,,,,,,2,1,
\x95\x9F\x93\x87,111,108,,1,,2,39,7,32,19,1,2,3,,,,,,4,1,
\x88\xEF\x8F\xE9,158,153,,2,,3,52,14,36,25,,5,3,,,,2,1,13,1,1
\x93Ȗ\xD8,103,97,,1,,2,37,8,24,19,,5,,,,,,,6,1,
\x8CQ\x94n,90,87,,1,,3,34,6,22,13,1,4,,,,,1,,4,1,
\x8D\xE9\x8B\xCA,227,222,2,1,,3,83,25,46,36,,10,,,,,3,,15,3,
\x90\xE7\x97t,265,258,3,1,1,2,90,22,56,48,1,8,9,1,,,1,,18,2,2
\x93\x8C\x8B\x9E,308,307,3,1,,3,146,13,54,36,1,2,6,2,2,4,3,2,18,8,4
\x90_\x93ސ\xEC,265,262,6,1,,3,86,21,47,36,2,10,7,3,4,,5,7,21,4,2
\x90V\x8A\x83,136,135,3,1,,3,48,15,31,21,2,1,4,,2,,,,4,1,
\x95x\x8ER,84,81,,1,,3,27,8,18,14,1,2,,1,,,,2,6,1,
\x90ΐ\xEC,75,71,,1,,2,24,5,14,14,1,3,3,,,1,,,6,1,
\x95\x9F\x88\xE4,63,62,,,,3,24,5,12,10,1,2,3,,,,,,2,1,
\x8ER\x97\x9C,54,51,,1,,2,14,5,14,12,1,2,,,,,,,2,1,
\x92\xB7\x96\xEC,126,124,,,,2,43,14,30,18,2,3,,,,2,,,11,1,
\x8A\xF2\x95\x8C,122,117,,3,,4,46,11,35,14,,2,,,,,,,5,2,
\x90É\xAA,146,145,4,1,1,2,46,13,30,22,,2,5,,2,2,3,1,9,3,
\x88\xA4\x92m,264,254,3,1,,3,88,24,56,44,1,12,3,3,,,2,1,19,3,1
\x8EO\x8Fd,95,93,,1,1,2,34,6,26,12,,1,5,,,,,,6,1,
\x8E\xA0\x89\xEA,62,58,,1,,2,20,5,13,11,1,3,,,,,,,4,1,1
\x8B\x9E\x93s,102,98,3,1,,3,33,7,20,15,1,3,,1,1,,2,2,8,2,
\x91\xE5\x8D\xE3,247,241,4,1,,4,92,21,46,29,2,7,9,1,3,,1,2,21,2,2
\x95\xBA\x8C\xC9,215,210,2,1,1,3,73,19,57,26,2,8,5,,4,,1,,9,3,1
\x93ޗ\xC7,52,50,,,,2,15,5,13,10,,2,,,,,,,4,1,
\x98a\x89̎R,70,66,,1,,2,24,8,16,11,1,4,,,,,,,2,1,
\x92\xB9\x8E\xE6,44,42,,1,,3,16,3,7,7,1,2,,,,,,1,2,1,
\x93\x87\x8D\xAA,60,59,,,,2,20,5,18,8,,1,,,,,1,,4,1,
\x89\xAA\x8ER,101,98,2,1,,3,29,12,23,14,1,3,3,,,,1,,7,2,
\x8DL\x93\x87,151,149,2,1,,2,52,11,36,21,1,3,3,,2,2,,1,10,2,2
\x8ER\x8C\xFB,72,71,,,,2,26,7,17,11,,2,,,,,,2,4,1,
\x93\xBF\x93\x87,50,48,,1,,3,13,6,14,6,1,1,3,,,,,,1,1,
\x8D\x81\x90\xEC,49,47,,1,,3,18,4,11,7,,2,,,,,,,2,1,
\x88\xA4\x95Q,81,78,,1,,2,24,9,19,12,,2,3,,2,,1,,4,1,1
\x8D\x82\x92m,50,49,,1,,2,15,4,13,8,1,2,,,,,,,2,2,
\x95\x9F\x89\xAA,138,133,4,2,,4,37,10,31,17,1,8,1,1,,,1,3,13,3,2
\x8D\xB2\x89\xEA,43,41,,1,,2,13,4,10,8,,1,,,,,,,4,,
\x92\xB7\x8D\xE8,73,72,,,,2,27,6,22,9,,2,3,,,,,,1,1,
\x8CF\x96{,96,93,2,1,,2,27,12,24,13,1,4,,,,2,1,1,5,1,
\x91啪,56,55,,1,,2,20,6,11,11,,1,,,,,,1,2,1,
\x8B{\x8D\xE8,49,47,,,,2,16,4,12,10,,2,,,,,,,2,1,
\x8E\xAD\x8E\x99\x93\x87,91,87,,1,,3,26,10,28,11,1,3,3,,,,1,,3,1,
\x89\xAB\x93\xEA,52,50,,,,2,19,5,17,6,,2,,,,,1,,,,
\x8D\x87\x8Cv,5451,5301,48,43,4,124,1904,462,1232,810,33,162,107,15,26,13,34,34,305,76,19
